{"text_format":"1","workbook":"xlsx","n_sheets":11,"sheets":["Vejledning","1.Aktuelle kompetencer","2.a Kompetencegab","2.b Egen ideal-profil","Overblik ","Kompetenceramme-viden om","Kompetenceramme-niveauer","Opgave-kompetence-kryds ","Input til Overblik","SamletKompetenceramme","OrganisationsTypeKompetencebeho"],"not_rendered":{"charts":1,"images":5,"macros":1,"external_links":0,"defined_names":2,"comments":3,"pivot_tables":0},"unopened":[],"bounds":{"document_bytes":16777216,"sheet_cells":100000,"rows_first":2000,"rows_last":500,"rows_between":2000,"halvings":0,"cell_chars":16384,"cell_head_chars":4096},"cells_cut":0,"cells_raw":0,"read":"whole","date_system":"1900"}

{"sheet":"Vejledning","index":0,"n_rows":28,"n_cols":5,"rows_kept":28,"cut":false,"hidden":false,"merged":[[10,1,14,1],[15,1,17,1],[18,1,23,1],[27,2,27,4],[26,2,26,4],[25,2,25,4],[24,2,24,4],[0,3,0,4],[0,5,4,5],[6,3,6,4],[8,11,8,23],[6,1,6,2]]}
[null,null,null,"STAMDATA"]
[null,null,null,"Ministerie/styrelse","[Indsæt stamdata]"]
[null,null,null,"Kontor/enhed","[Indsæt stamdata]"]
[null,null,null,"Kontorchef","[Indsæt stamdata]"]
[null,null,null,"Teamledere","[Indsæt stamdata]"]
[]
[null,"Vejledning til felter",null,"Yderligere hjælp til at arbejde med Rådgivningsenhedens Kompetencekortlægningsværktøj kan findes i en udførlig vejledning, der ligger på hjemmesiden og som kan tilgås ved at trykke her"]
[]
[null,"Faneblad","Felt(er)","Beskrivelse","Uddybende beskrivelse"]
[null,"Vejledning","Stamdata","Kontorets eller enhedens stamdata, f.eks. navn, ledelse mm. ","Øverst på dette ark udfyldes stamdata som automatisk overføres til Ark 1, Ark 2, og Ark 3 samt til Overbliks-arket."]
{"$rows_left_out":19}
{"sheet":"1.Aktuelle kompetencer","index":1,"n_rows":32,"n_cols":7,"rows_kept":32,"cut":false,"hidden":false,"merged":[[31,1,31,6],[0,5,0,6],[0,1,4,4],[8,1,8,2],[18,1,18,2],[25,1,25,2]]}
[null,null,null,null,null,"STAMDATA"]
[null,null,null,null,null,"Ministerie/styrelse",{"$f":"IF(Vejledning!$E2=\"[Indsæt stamdata]\",\"[Skriv stamdata i Vejledning]\",Vejledning!$E2)","v":"[Skriv stamdata i Vejledning]"}]
[null,null,null,null,null,"Kontor/enhed",{"$f":"IF(Vejledning!$E3=\"[Indsæt stamdata]\",\"[Skriv stamdata i Vejledning]\",Vejledning!$E3)","v":"[Skriv stamdata i Vejledning]"}]
[null,null,null,null,null,"Kontorchef",{"$f":"IF(Vejledning!$E4=\"[Indsæt stamdata]\",\"[Skriv stamdata i Vejledning]\",Vejledning!$E4)","v":"[Skriv stamdata i Vejledning]"}]
[null,null,null,null,null,"Teamledere",{"$f":"IF(Vejledning!$E5=\"[Indsæt stamdata]\",\"[Skriv stamdata i Vejledning]\",Vejledning!$E5)","v":"[Skriv stamdata i Vejledning]"}]
[]
[null,"Afdæk organisationens nuværende kompetencer"]
[]
[null,"Indkøbsspecifikke kompetencer: Horisontale",null,"Aktuelt kompetenceniveau","Beskrivelse","Eksempler på opgaver","Kommentarer"]
[null,"K1","Strategisk planlægning","[Vælg niveau]",{"$f":"IFERROR(VLOOKUP(D10,SamletKompetenceramme!$B$4:$D$8,3,FALSE),\"[Udfyld kolonne D]\")","v":"[Udfyld kolonne D]"}]
{"$rows_left_out":23}
{"sheet":"2.a Kompetencegab","index":2,"n_rows":38,"n_cols":8,"rows_kept":38,"cut":false,"hidden":false,"merged":[[0,5,0,7],[11,1,11,7],[1,5,1,6],[2,5,2,6],[3,5,3,6],[4,5,4,6],[10,1,10,3],[10,4,10,7],[8,1,8,7],[9,1,9,3],[9,4,9,7],[24,6,24,7],[31,6,31,7],[13,1,13,4],[13,6,13,7],[14,1,14,3],[24,1,24,3],[31,1,31,3]]}
[null,null,null,null,null,"STAMDATA"]
[null,null,null,null,null,"Ministerie/styrelse",null,{"$f":"IF(Vejledning!$E2=\"[Indsæt stamdata]\",\"[Skriv stamdata i Vejledning]\",Vejledning!$E2)","v":"[Skriv stamdata i Vejledning]"}]
[null,null,null,null,null,"Kontor/enhed",null,{"$f":"IF(Vejledning!$E3=\"[Indsæt stamdata]\",\"[Skriv stamdata i Vejledning]\",Vejledning!$E3)","v":"[Skriv stamdata i Vejledning]"}]
[null,null,null,null,null,"Kontorchef",null,{"$f":"IF(Vejledning!$E4=\"[Indsæt stamdata]\",\"[Skriv stamdata i Vejledning]\",Vejledning!$E4)","v":"[Skriv stamdata i Vejledning]"}]
[null,null,null,null,null,"Teamledere",null,{"$f":"IF(Vejledning!$E5=\"[Indsæt stamdata]\",\"[Skriv stamdata i Vejledning]\",Vejledning!$E5)","v":"[Skriv stamdata i Vejledning]"}]
[]
[null,"Analyse af organisationens kompetencebehov "]
[]
[null,"Vælg type af organisation:"]
[null,"A = Få ens opgaver",null,null,"B = Flere komplekse opgaver"]
{"$rows_left_out":29}
{"sheet":"2.b Egen ideal-profil","index":3,"n_rows":32,"n_cols":7,"rows_kept":32,"cut":false,"hidden":false,"merged":[[8,1,8,2],[18,1,18,2],[25,1,25,2],[31,1,31,6],[0,1,4,4],[0,5,0,6]]}
[null,null,null,null,null,"STAMDATA"]
[null,null,null,null,null,"Ministerie/styrelse",{"$f":"IF(Vejledning!$E2=\"[Indsæt stamdata]\",\"[Skriv stamdata i Vejledning]\",Vejledning!$E2)","v":"[Skriv stamdata i Vejledning]"}]
[null,null,null,null,null,"Kontor/enhed",{"$f":"IF(Vejledning!$E3=\"[Indsæt stamdata]\",\"[Skriv stamdata i Vejledning]\",Vejledning!$E3)","v":"[Skriv stamdata i Vejledning]"}]
[null,null,null,null,null,"Kontorchef",{"$f":"IF(Vejledning!$E4=\"[Indsæt stamdata]\",\"[Skriv stamdata i Vejledning]\",Vejledning!$E4)","v":"[Skriv stamdata i Vejledning]"}]
[null,null,null,null,null,"Teamledere",{"$f":"IF(Vejledning!$E5=\"[Indsæt stamdata]\",\"[Skriv stamdata i Vejledning]\",Vejledning!$E5)","v":"[Skriv stamdata i Vejledning]"}]
[]
[null,"Angiv jeres egen ideal-kompetenceprofil (valgfri)"]
[]
[null,"Indkøbsspecifikke kompetencer: \nHorisontale",null,"Kompetencebehov","Beskrivelse","Eksempler på opgaver","Kommentarer"]
[null,"K1","Strategisk Planlægning","[Vælg niveau]",{"$f":"IFERROR(VLOOKUP(D10,SamletKompetenceramme!B4:D8,3,FALSE),\"[Udfyld kolonne D]\")","v":"[Udfyld kolonne D]"}]
{"$rows_left_out":23}
{"sheet":"Overblik ","index":4,"n_rows":37,"n_cols":7,"rows_kept":37,"cut":false,"hidden":false,"merged":[[0,1,4,4],[0,5,0,6],[10,1,10,2],[27,1,27,2],[5,1,7,3],[20,1,20,2]]}
[null,null,null,null,null,"STAMDATA"]
[null,null,null,null,null,"Ministerie/styrelse",{"$f":"IF(Vejledning!$E2=\"[Indsæt stamdata]\",\"[Skriv stamdata i Vejledning]\",Vejledning!$E2)","v":"[Skriv stamdata i Vejledning]"}]
[null,null,null,null,null,"Kontor/enhed",{"$f":"IF(Vejledning!$E3=\"[Indsæt stamdata]\",\"[Skriv stamdata i Vejledning]\",Vejledning!$E3)","v":"[Skriv stamdata i Vejledning]"}]
[null,null,null,null,null,"Kontorchef",{"$f":"IF(Vejledning!$E4=\"[Indsæt stamdata]\",\"[Skriv stamdata i Vejledning]\",Vejledning!$E4)","v":"[Skriv stamdata i Vejledning]"}]
[null,null,null,null,null,"Teamledere",{"$f":"IF(Vejledning!$E5=\"[Indsæt stamdata]\",\"[Skriv stamdata i Vejledning]\",Vejledning!$E5)","v":"[Skriv stamdata i Vejledning]"}]
[null,"Resultat og overblik"]
[]
[]
[null,"På dette ark kan I se et overblik over indkøbsorganisationens kompetencekortlægning og kompetenceområder, hvor der er behov for kompetenceløft"]
[]
{"$rows_left_out":28}
{"sheet":"Kompetenceramme-viden om","index":5,"n_rows":37,"n_cols":2,"rows_kept":37,"cut":false,"hidden":false,"merged":[[32,0,32,1],[1,0,1,1],[11,0,11,1],[18,0,18,1],[23,0,23,1],[28,0,28,1]]}
["Kompetenceområde","Viden om…"]
["Indkøbsspecifikke kompetencer: \nHorisontale"]
["Strategisk Planlægning","Organisationens udbuds- og indkøbsplanlægning og politiske prioriteter, herunder budgetter og relevante nationale strategier, initiativer og politikker."]
["Indkøbs-/udbudsprocessen","Indkøbscyklussen fra forberedelserne til offentliggørelse og tiden efter tildeling, og hvordan de forskellige faser hænger sammen."]
["Lovgivning","Lovgivningen om offentlige indkøb på såvel nationalt plan samt EU-plan samt beslægtede retsområder og deres betydning for offentlige indkøb."]
["E-udbudsværktøjer o.a. IT","elektroniske udbudssystemer og andre relevante IT-systemer, der anvendes i organisationen."]
["Bæredygtige indkøb","Organisationens bæredygtighedsmål (miljømæssige og sociale) og relaterede nationale politikker samt de værktøjer, standarder og teknikker, der findes til at indarbejde dem i indkøbsprocessen."]
["Offentlige indkøb af innovationsløsninger","Organisationens målsætninger for innovation og beslægtede nationale politikker samt de værktøjer og teknikker, der kan bruges til at indarbejde dem i indkøbsprocessen."]
["Kategoristyring","De egenskaber og særtræk, der er relevante for en eller flere kategorier af varer eller tjenesteydelser, herunder leverandørfelt, tekniske forhold og markedsforhold."]
["Leverandørstyring","Strategier og processer til udvikling og styring af relationerne til leverandører i overensstemmelse med principperne for offentlige indkøb."]
{"$rows_left_out":28}
{"sheet":"Kompetenceramme-niveauer","index":6,"n_rows":24,"n_cols":5,"rows_kept":24,"cut":false,"hidden":false,"merged":[[11,0,11,4],[19,0,19,4]]}
["Kompetence","Niveau 1","Niveau 2"," Niveau 3"," Niveau 4"]
["Indkøbsspecifikke kompetencer:","At have kendskab til …","At forstå og kunne anvende …","At kunne analysere og beherske …","At kunne vurdere og skabe nye indsigter, tiltag eller initiativer …"]
["Strategisk Planlægning","At have kendskab til grundlæggende opgaver i forbindelse med udbudsplanlægning fx indsamling og konsolidering af bidrag fra forskellige afdelinger.","At foretage research og indsamle input til udbudsplanlægningen samt omsætte politiske og organisatoriske prioriteringer og strategier i den daglige praksis for indkøb og udbud.","At koordinere arbejdet med organisationens planlægning og gennemførelse af indkøb, herunder tidsplaner, budgetter, ressourcer mm.","At fastsætte visionen for organisationens udbud og relaterede politikker, herunder fungere som bindeled for beslutningstagere samt feedback til det politiske niveau på indkøbs- og udbudsområdet "]
["Indkøbs-/udbudsprocessen","At have kendskab til indkøbets/udbuddets faser fra før tildeling til efter tildeling og hvordan disse faser interagerer.","At kunne implementere forskellige indkøbs- og udbudsfaser og forstå sammenhænge, risici og muligheder på tværs af faser.","At lede og vejlede i gennemførelsen af alle faser i udbudscyklussen effektivt og med fokus på at skabe mest værdi for pengene.","At udforme interne politikker og værktøjer så sammenhængen mellem udbudsfaserne udnyttes til at opnå størst mulig effektivitet og værdi for pengene."]
["Lovgivning","At have kendskab til gældende lovgivning om offentlige udbud på nationalt og EU-niveau samt beslægtede retsområder","At forstå lovgivningens konsekvenser og indvirkning på udbudssystemet og forsyningskæden ","At anvende national/EU retlige rammer i udformningen af udbud samt tage skridt til at styre forsyningskæderne vha. specifikke aspekter af udbuds","At fremme vedtagelsen af ikke-bindende og innovative retlige bestemmelser, der giver nye muligheder samt deltage i ekspertarbejdsgrupper om lovgivning af offentlige indkøb."]
["E-udbuds-værktøjer o.a. IT","At have grundlæggende kendskab til e-udbudsplatforme og andre relevante IT-systemer der anvendes i organisationen.","At bruge e-udbudsplatforme og andre relevante IT-systemer der anvendes i organisationen, herunder nationale og europæiske udbudssystemer.","At implementere og udrulle en bred vifte af udbudssystemer og –værktøjer i organisationen, samt analysere udbudsdata mhp. overvågning af budgettet. ","At bidrage til indførelse, forbedring og/eller udvikling af nye e-udbudssystemer og IT-værktøjer, samt analysere udbudsdata mhp. at forbedre udbudsprocedure."]
["Bæredygtige indkøb","At have kendskab til omfanget og fordelene ved at gennemføre bæredygtige indkøb samt hvordan bæredygtighedsaspekter kan indarbejdes i offentlige indkøb f.eks. gennem mærkninger, standarder, TCO mm.","At kunne indarbejde bæredygtighedsaspekter i tekniske specifikationer, udvælgelses- og tildelingskriterier, kontraktbestemmelser og resultatindikatorer. ","At omsætte organisationens bæredygtighedsmål (miljømæssige og sociale) og relaterede nationale politikker i offentlige indkøb og udbud samt mestre gennemførelsen af grønne udbud.","At udforme organisationens strategi for bæredygtige indkøb og udbud, samt sikre politisk støtte og at strategien gennemføres effektivt. "]
["Offentlige indkøb af innovationsløsninger","At forstå hvorfor og hvordan innovationsaspekter indarbejdes i offentlige indkøb og bistå ved gennemførelsen heraf.","At kunne udarbejde forretningsplan samt anvende værktøjer og teknikker i udbudsprocessen mhp. at fremme udviklingen og brugen af innovative løsninger i organisationen.","At gennemføre organisationens strategi for offentlige indkøb af innovationsløsninger samt sikre at der findes et system til overvågning af udgifter sammenholdt med opnåede virkning.","At udvikle strategier for offentlige indkøb af innovative løsninger i organisationen og opstille prioriteter på grundlag af innovationseffekt, indvirkning på budget samt potentiel indflydelse på markedet."]
["Kategoristyring","At foretage research og levere relevante oplysninger om en kategori af varer/tjenesteydelser mhp. at der kan træffes informerede indkøbsbeslutninger.","At kontrollere om der findes retlige og reguleringsmæssige krav til deres kategorier af varer, tjenesteydelser eller arbejde samt bidrage til opstilling af tekniske krav","At planlægge eller kategorisere de planlagte udgifter efter markedstendenser under hensyntagen til kvalitet, service, risiko og omkostninger.","At fungere som referencepunkt for offentlige indkøbere og udarbejde målrettede tematiske retningslinjer for kategorien."]
["Leverandørstyring","At have kendskab til strategier og processer til udvikling og styring af leverandørrelationer i","At anvende strategier og processer til udvikling og styring af leverandørrelationer i overensstemmelse med principperne for offentlige indkøb.","At analysere leverandørtendenser og udlede mulige forbedringer, herunder fremme etiske, bæredygtige og økonomisk fordelagtige forsyningskæder. ","At udvikle strategier og processer til udvikling og styring af leverandører, samt at udforme og udnytte etiske bæredygtige og økonomisk fordelagtige forsyningskæder."]
{"$rows_left_out":15}
{"sheet":"Opgave-kompetence-kryds ","index":7,"n_rows":80,"n_cols":5,"rows_kept":80,"cut":false,"hidden":false,"merged":[[24,0,30,0],[42,0,44,0],[39,0,41,0],[46,0,48,0],[64,0,75,0],[52,0,63,0],[36,0,38,0],[0,3,0,4],[3,0,9,0],[10,0,16,0],[17,0,23,0],[0,2,1,2],[0,1,1,1],[0,0,1,0]]}
["Typiske opgaver","Kompetenceområde","K#","Kompetenceniveauer for afdeling med…"]
[null,null,null,"...få ens opgaver","...flere komplekse opgaver"]
["Afklaring af indkøbsbehov","Behovsvurdering / brugerdialog","K10",3,3]
["Indkøb via eksisterende rammeaftaler - Statens indkøbsprogram /  øvrige SKI / egne","Indkøbs-/udbudsprocessen","K2",3,3]
[null,"Lovgivning","K3",3,3]
[null,"Elektroniske udbudsværktøjer ","K4",2,3]
[null,"Bæredygtige indkøb","K5",2,3]
[null,"Offentlige indkøb af innovationsløsninger ","K6",1,1]
[null,"Behovsvurdering / brugerdialog","K10",2,2]
[null,"Markedsanalyse / -dialog","K11",2,3]
{"$rows_left_out":71}
{"sheet":"Input til Overblik","index":8,"n_rows":20,"n_cols":3,"rows_kept":20,"cut":false,"hidden":true,"merged":[]}
[null,"Aktuelle kompetencer","Kompetencebehov "]
["Strategisk Planlægning",{"$f":"VALUE(RIGHT('1.Aktuelle kompetencer'!D10))","v":{"$error":"#VALUE!"}},{"$f":"VALUE(RIGHT('2.a Kompetencegab'!D16))","v":{"$error":"#VALUE!"}}]
["Indkøbs-/udbudsprocessen",{"$f":"VALUE(RIGHT('1.Aktuelle kompetencer'!D11))","v":{"$error":"#VALUE!"}},{"$f":"VALUE(RIGHT('2.a Kompetencegab'!D17))","v":{"$error":"#VALUE!"}}]
["Lovgivning",{"$f":"VALUE(RIGHT('1.Aktuelle kompetencer'!D12))","v":{"$error":"#VALUE!"}},{"$f":"VALUE(RIGHT('2.a Kompetencegab'!D18))","v":{"$error":"#VALUE!"}}]
["E-udbudsværktøjer o.a. IT",{"$f":"VALUE(RIGHT('1.Aktuelle kompetencer'!D13))","v":{"$error":"#VALUE!"}},{"$f":"VALUE(RIGHT('2.a Kompetencegab'!D19))","v":{"$error":"#VALUE!"}}]
["Bæredygtige indkøb",{"$f":"VALUE(RIGHT('1.Aktuelle kompetencer'!D14))","v":{"$error":"#VALUE!"}},{"$f":"VALUE(RIGHT('2.a Kompetencegab'!D20))","v":{"$error":"#VALUE!"}}]
["Offentlige indkøb af innovationsløsninger",{"$f":"VALUE(RIGHT('1.Aktuelle kompetencer'!D15))","v":{"$error":"#VALUE!"}},{"$f":"VALUE(RIGHT('2.a Kompetencegab'!D21))","v":{"$error":"#VALUE!"}}]
["Kategoristyring",{"$f":"VALUE(RIGHT('1.Aktuelle kompetencer'!D16))","v":{"$error":"#VALUE!"}},{"$f":"VALUE(RIGHT('2.a Kompetencegab'!D22))","v":{"$error":"#VALUE!"}}]
["Leverandørstyring",{"$f":"VALUE(RIGHT('1.Aktuelle kompetencer'!D17))","v":{"$error":"#VALUE!"}},{"$f":"VALUE(RIGHT('2.a Kompetencegab'!D23))","v":{"$error":"#VALUE!"}}]
["Forhandlingsteknik",{"$f":"VALUE(RIGHT('1.Aktuelle kompetencer'!D18))","v":{"$error":"#VALUE!"}},{"$f":"VALUE(RIGHT('2.a Kompetencegab'!D24))","v":{"$error":"#VALUE!"}}]
{"$rows_left_out":11}
{"sheet":"SamletKompetenceramme","index":9,"n_rows":132,"n_cols":4,"rows_kept":132,"cut":false,"hidden":true,"merged":[[88,2,92,2],[101,2,105,2],[107,2,111,2],[113,2,117,2],[71,2,74,2],[76,2,80,2],[82,2,86,2],[96,2,99,2],[3,2,7,2],[9,2,13,2],[15,2,19,2],[21,2,25,2],[27,2,31,2],[64,2,68,2],[33,2,37,2],[39,2,43,2],[45,2,49,2],[51,2,55,2],[58,2,62,2]]}
[null,"Kompetence","Viden om…","Beskrivelse ift. niveau "]
[null,"Indkøbsspecifikke kompetencer: \nHorisontale"]
[null,"[Vælg niveau]"]
[null,0,"Organisationens udbuds- og indkøbsplanlægning og politiske prioriteter, herunder budgetter og relevante nationale strategier, initiativer og politikker.","Intet kendskab"]
["K1","Strategisk Planlægning, Niveau 1",null,"At have kendskab til grundlæggende opgaver i forbindelse med udbudsplanlægning fx indsamling og konsolidering af bidrag fra forskellige afdelinger."]
["K1","Strategisk Planlægning, Niveau 2",null,"At foretage research og indsamle input til udbudsplanlægningen samt omsætte politiske og organisatoriske prioriteringer og strategier i den daglige praksis for indkøb og udbud."]
["K1","Strategisk Planlægning, Niveau 3",null,"At koordinere arbejdet med organisationens planlægning og gennemførelse af indkøb, herunder tidsplaner, budgetter, ressourcer mm."]
["K1","Strategisk Planlægning, Niveau 4",null,"At fastsætte visionen for organisationens udbud og relaterede politikker, herunder fungere som bindeled for beslutningstagere samt feedback til det politiske niveau på indkøbs- og udbudsområdet "]
[null,"[Vælg niveau]"]
[null,0,"Indkøbscyklussen fra forberedelserne til offentliggørelse og tiden efter tildeling, og hvordan de forskellige faser hænger sammen.","Intet kendskab"]
{"$rows_left_out":123}
{"sheet":"OrganisationsTypeKompetencebeho","index":10,"n_rows":23,"n_cols":8,"rows_kept":23,"cut":false,"hidden":true,"merged":[[0,0,0,3],[0,4,0,7]]}
["Flere komplekse opgaver",null,null,null,"Få ens opgaver"]
[null,"Indkøbsspecifikke kompetencer: \nHorisontale","Kompetence behov ","Kommentarer ",null,"Indkøbsspecifikke kompetencer: \nHorisontale","Kompetence behov ","Kommentarer "]
["K1","Strategisk Planlægning","Strategisk Planlægning, Niveau 4",null,"K1","Strategisk Planlægning","Strategisk Planlægning, Niveau 3"]
["K2","Indkøbs-/udbudsprocessen","Indkøbs-/udbudsprocessen, Niveau 3","Denne optræder også på niveau 2 under organisationstype 'Mange komplekse opgaver'","K2","Indkøbs-/udbudsprocessen","Indkøbs-/udbudsprocessen, Niveau 3"]
["K3","Lovgivning","Lovgivning, Niveau 3",null,"K3","Lovgivning","Lovgivning, Niveau 3"]
["K4","E-udbudsværktøjer o.a. IT","E-udbudsværktøjer o.a. IT, Niveau 3",null,"K4","E-udbudsværktøjer o.a. IT","E-udbudsværktøjer o.a. IT, Niveau 2"]
["K5","Bæredygtige indkøb","Bæredygtige indkøb, Niveau 3",null,"K5","Bæredygtige indkøb","Bæredygtige indkøb, Niveau 2"]
["K6","Offentlige indkøb af innovationsløsninger","Offentlige indkøb af innovationsløsninger, Niveau 1",null,"K6","Offentlige indkøb af innovationsløsninger","Offentlige indkøb af innovationsløsninger, Niveau 1"]
["K7","Kategoristyring","Kategoristyring, Niveau 3",null,"K7","Kategoristyring","Kategoristyring, Niveau 3","Optræder også på niveau 0 "]
["K8","Leverandørstyring","Leverandørstyring, Niveau 4",null,"K8","Leverandørstyring","Leverandørstyring, Niveau 2","Denne optræder også på niveau 1 "]
{"$rows_left_out":13}